{"text_format":"1","workbook":"xlsx","n_sheets":11,"sheets":["RESUMO","TAB.REF","CRONOGRAMA","PLAN. BDI.IMP","CVCTEC-77","CVCTEC-79","CVCTEC-80","CVCTEC-83","CVCTEC-84","PMPATOS_004DR","PMPATOS_005DR"],"not_rendered":{"charts":0,"images":4,"macros":1,"external_links":1,"defined_names":18,"comments":0,"pivot_tables":0},"unopened":[],"bounds":{"document_bytes":16777216,"sheet_cells":100000,"rows_first":2000,"rows_last":500,"rows_between":2000,"halvings":0,"cell_chars":16384,"cell_head_chars":4096},"cells_cut":0,"cells_raw":0,"read":"whole","date_system":"1900"}

{"sheet":"RESUMO","index":0,"n_rows":23,"n_cols":8,"rows_kept":23,"cut":false,"hidden":false,"merged":[[20,1,20,4],[21,1,21,4],[22,1,22,4],[19,1,19,4],[6,3,7,3],[6,2,7,2],[6,1,7,1],[18,0,18,4],[15,0,15,3],[4,1,4,2],[4,5,4,6],[2,1,2,4],[15,5,15,6],[16,0,16,7],[14,5,14,6],[8,5,8,6],[9,5,9,6],[10,5,10,6],[11,5,11,6],[12,5,12,6],[5,0,5,6],[6,0,7,0],[6,4,6,6],[7,5,7,6],[13,5,13,6],[0,0,0,6],[1,0,1,6],[2,5,2,6],[3,1,3,2],[3,5,3,6]]}
[]
["PLANILHA ORÇAMENTÁRIA  RESUMO"]
["OBRA:","PROJETOS DE MODIFICAÇÃO, EXTENSÃO DE REDE  E ILUMINAÇÃO PÚBLICA",null,null,null,"BDI:",null,"(com desoneração)"]
["LOCAL:","DIVERSOS - MUNICIPIO DE PATOS DE MINAS",null,"ART:",null,null,null,"(sem desoneração)"]
["REFERÊNCIA:","PREÇOS DE MERCADO",null,"DATA:","2020-02-04",{"$f":"IF(H5=1,'PLAN. BDI.IMP'!D45,'PLAN. BDI.IMP'!D40)","v":0.31559999999999999},null,1]
[]
["ITEM","Descrição","BAIRRO","REFERÊNCIA","VALOR TOTAL"]
[null,null,null,null,"SEM BDI","COM BDI"]
[1,"Rua Laumar da Rocha Filgueira (extensão)","JARDIM RECANTO","CVCTEC_PMINAS_77",{"$f":"'CVCTEC-77'!F52","v":15998.86},{"$f":"'CVCTEC-77'!H52","v":21047.85}]
[2,"Avenida A (extensão)","JARDIM PANORÂMICO","CVCTEC_PMINAS_79",{"$f":"'CVCTEC-79'!F61","v":29475.75},{"$f":"'CVCTEC-79'!H61","v":38777.82}]
{"$rows_left_out":14}
{"sheet":"TAB.REF","index":1,"n_rows":140,"n_cols":4,"rows_kept":140,"cut":false,"hidden":false,"merged":[[0,0,0,16383]]}
["VALORES DE REFERÊNCIA"]
["CÓDIGO","DESCRIÇÃO","UNIDADE","PREÇO"]
[114,"LUMINARIA LED POTÊNCIA ATÉ 114W FLUXO LUMINOSO APROXIMADO 13.100lm EFICIENCIA LUMINOSA ≥ 115lm/w","PC",880.15]
[120,"LUMINARIA LED POTÊNCIA ATÉ 120W FLUXO LUMINOSO APROXIMADO 13.800lm EFICIENCIA LUMINOSA ≥ 115lm/w","PC",767]
[150,"LUMINARIA LED POTÊNCIA ATÉ 150W FLUXO LUMINOSO APROXIMADO 17.250lm EFICIENCIA LUMINOSA ≥ 115lm/w","PC",1235]
[2931,"CABO DE AÇO MR 1/4P (6,4MM) 7 FIOS","KG",2.76]
[2964,"CABO DE AÇO HS 3/8P (9,5MM²) 7FIOS","KG",7.78]
[3954,"FITA ADESIVA ISOLANTE PVC 19MMX20M","RL",4.97]
[39586,"COBERTURA PROTETORA PARA BUCHA DE EQUIPAMENTO","PC",9.67]
[66688,"PARAFUSO CABEÇA ABAULADA M12X 40MM","PC",1.63]
{"$rows_left_out":131}
{"sheet":"CRONOGRAMA","index":2,"n_rows":40,"n_cols":18,"rows_kept":40,"cut":false,"hidden":false,"merged":[[37,4,37,13],[38,4,38,13],[39,4,39,13],[33,4,33,13],[1,0,1,17],[2,1,2,17],[3,1,3,17],[4,1,4,6],[4,7,4,11],[4,12,4,14],[4,15,4,17],[5,0,5,17],[6,0,8,0],[6,1,8,6],[6,7,8,7],[6,8,8,8],[6,9,6,17],[7,9,7,11],[7,12,7,14],[7,15,7,17],[9,1,9,6],[10,1,10,6],[11,1,11,6],[30,0,30,17],[31,1,31,6],[18,1,18,6],[19,1,19,6],[20,1,20,6],[21,1,21,6],[35,0,35,6],[36,0,36,17],[12,1,12,6],[13,1,13,6],[14,1,14,6],[15,1,15,6],[16,1,16,6],[17,1,17,6],[28,1,28,6],[29,1,29,6],[22,1,22,6],[23,1,23,6],[24,1,24,6],[25,1,25,6],[26,1,26,6],[27,1,27,6]]}
[]
["CRONOGRAMA FISICO-FINANCEIRO"]
["OBRA:","PROJETOS DE MODIFICAÇÃO, EXTENSÃO DE REDE  E ILUMINAÇÃO PÚBLICA"]
["LOCAL:","DIVERSOS - MUNICIPIO DE PATOS DE MINAS"]
["REFERÊNCIA:","PREÇOS DE MERCADO_COTAÇÃO Janeiro/2020",null,null,null,null,null,"BDI (PUBLICAÇÃO TCU - ACÓRDÃO Nº 2622/2013):",null,null,null,null,{"$f":"RESUMO!F5","v":0.31559999999999999},null,null,{"$f":"RESUMO!E5","v":"2020-02-04"}]
[]
["ITEM","DISCRIMINAÇÃO DE SERVIÇOS",null,null,null,null,null,"VALOR SERVIÇOS (R$)","PESO (%)","SERVIÇOS A EXECUTAR"]
[null,null,null,null,null,null,null,null,null,"MÊS - 1",null,null,"MÊS - 2",null,null,"MÊS - 3"]
[null,null,null,null,null,null,null,null,null,"SIMPL.%","R$","ACUM.%","SIMPL.%","R$","ACUM.%","SIMPL.%","R$","ACUM.%"]
[1,{"$f":"'CVCTEC-77'!$A$4","v":"LOCAL: CVCTEC_PMINAS_77 - RUA LAUMAR ROCHA FILGUEIRA E OUTRAS - B. JARDIM RECANTO"},null,null,null,null,null,{"$f":"SUM(H11:H12)","v":21047.85}]
{"$rows_left_out":31}
{"sheet":"PLAN. BDI.IMP","index":3,"n_rows":61,"n_cols":10,"rows_kept":61,"cut":false,"hidden":false,"merged":[[1,0,1,9],[2,0,2,9],[4,0,4,9],[5,0,5,9],[49,0,51,9],[44,1,45,2],[44,3,45,4],[6,8,6,9],[30,0,30,9],[35,0,35,1],[39,1,40,2],[39,3,40,4],[39,5,40,6],[57,0,57,9],[58,0,58,9],[59,0,59,9],[60,0,60,9],[56,0,56,4]]}
[]
["COMPOSIÇÃO DO BDI (Bonificações e Despesas Indiretas)"]
["\"Estações e Redes de Distribuição de Energia Elétrica\""]
[]
["OBJETO: PROJETOS DE MODIFICAÇÃO, EXTENSÃO DE REDE  E ILUMINAÇÃO PÚBLICA"]
["LOCAL:  DIVERSOS - MUNICIPIO DE PATOS DE MINAS"]
["PROF. RESP.: DIOGO SOARES RESENDE",null,null,null,null,"CREA-MG","194.419/D","DATA:",{"$f":"RESUMO!E5","v":"2020-02-04"}]
[]
["1) ADMINISTRAÇÃO CENTRAL - ( 5,29% a 7,93%)"]
[]
{"$rows_left_out":52}
{"sheet":"CVCTEC-77","index":4,"n_rows":61,"n_cols":9,"rows_kept":61,"cut":false,"hidden":false,"merged":[[57,0,57,8],[60,0,60,8],[59,0,59,8],[51,0,51,4],[51,5,51,6],[51,7,51,8],[54,0,54,8],[56,0,56,6],[58,0,58,9],[49,0,49,4],[49,5,49,6],[49,7,49,8],[50,0,50,4],[50,5,50,6],[50,7,50,8],[47,0,47,4],[47,5,47,6],[47,7,47,8],[48,0,48,4],[48,5,48,6],[48,7,48,8],[42,0,42,4],[42,5,42,6],[42,7,42,8],[43,0,43,4],[43,5,43,6],[43,7,43,8],[6,0,6,8],[7,0,8,0],[7,1,8,1],[7,2,8,2],[7,3,8,3],[7,4,8,4],[7,5,7,6],[7,7,7,8],[1,0,1,8],[2,0,2,8],[3,0,3,8],[4,0,4,4],[5,0,5,4]]}
[]
["PLANILHA ORÇAMENTÁRIA "]
["OBJETO: PROJETOS DE MODIFICAÇÃO, EXTENSÃO DE REDE  E ILUMINAÇÃO PÚBLICA"]
["LOCAL: CVCTEC_PMINAS_77 - RUA LAUMAR ROCHA FILGUEIRA E OUTRAS - B. JARDIM RECANTO"]
["RESPONSÁVEL TÉCNICO: DIOGO SOARES RESENDE",null,null,null,null,"CREA:",{"$f":"LEFT(RIGHT(RESUMO!B23,11),8)","v":"194.419D"},"ART:"]
["REFERENCIA DE PREÇOS: PREÇOS DE MERCADO",null,null,null,null,"DATA: ",{"$f":"RESUMO!E5","v":"2020-02-04"},"BDI :",{"$f":"RESUMO!F5","v":0.31559999999999999}]
[]
["ITEM","CÓDIGO ","DESCRIÇÃO","UNID.","QUANT.","PREÇO SEM BDI",null,"PREÇO COM BDI"]
[null,null,null,null,null,"UNITÁRIO ","TOTAL","UNITÁRIO ","TOTAL"]
[1,228981,{"$f":"VLOOKUP(B10,TAB.REF!$A$3:$D$140,2)","v":"ALÇA PREFORMADA NEUTRO CA/CAL 16MM²"},{"$f":"VLOOKUP(B10,TAB.REF!$A$3:$D$140,3)","v":"PC"},10,{"$f":"VLOOKUP(B10,TAB.REF!$A$3:$D$140,4)","v":1.3},{"$f":"ROUND(F10*E10,2)","v":13},{"$f":"ROUND(F10*(1+$I$6),2)","v":1.71},{"$f":"ROUND(H10*E10,2)","v":17.100000000000001}]
{"$rows_left_out":52}
{"sheet":"CVCTEC-79","index":5,"n_rows":70,"n_cols":9,"rows_kept":70,"cut":false,"hidden":false,"merged":[[67,0,67,8],[68,0,68,8],[69,0,69,8],[60,0,60,4],[60,5,60,6],[60,7,60,8],[63,0,63,8],[65,0,65,6],[66,0,66,8],[58,0,58,4],[58,5,58,6],[58,7,58,8],[59,0,59,4],[59,5,59,6],[59,7,59,8],[56,0,56,4],[56,5,56,6],[56,7,56,8],[57,0,57,4],[57,5,57,6],[57,7,57,8],[51,0,51,4],[51,5,51,6],[51,7,51,8],[52,0,52,4],[52,5,52,6],[52,7,52,8],[6,0,6,8],[7,0,8,0],[7,1,8,1],[7,2,8,2],[7,3,8,3],[7,4,8,4],[7,5,7,6],[7,7,7,8],[1,0,1,8],[2,0,2,8],[3,0,3,8],[4,0,4,4],[5,0,5,4]]}
[]
["PLANILHA ORÇAMENTÁRIA "]
["OBJETO: PROJETOS DE MODIFICAÇÃO, EXTENSÃO DE REDE  E ILUMINAÇÃO PÚBLICA"]
["LOCAL: CVCTEC_PMINAS_79 - AV. A - B. JARDIM PANORAMICO"]
["RESPONSÁVEL TÉCNICO: DIOGO SOARES RESENDE",null,null,null,null,"CREA:",{"$f":"LEFT(RIGHT(RESUMO!B23,11),8)","v":"194.419D"},"ART:"]
["REFERENCIA DE PREÇOS: PREÇOS DE MERCADO",null,null,null,null,"DATA: ",{"$f":"RESUMO!E5","v":"2020-02-04"},"BDI :",{"$f":"RESUMO!F5","v":0.31559999999999999}]
[]
["ITEM","CÓDIGO ","DESCRIÇÃO","UNID.","QUANT.","PREÇO SEM BDI",null,"PREÇO COM BDI"]
[null,null,null,null,null,"UNITÁRIO ","TOTAL","UNITÁRIO ","TOTAL"]
[1,228981,{"$f":"VLOOKUP(B10,TAB.REF!$A$3:$D$140,2)","v":"ALÇA PREFORMADA NEUTRO CA/CAL 16MM²"},{"$f":"VLOOKUP(B10,TAB.REF!$A$3:$D$140,3)","v":"PC"},16,{"$f":"VLOOKUP(B10,TAB.REF!$A$3:$D$140,4)","v":1.3},{"$f":"ROUND(F10*E10,2)","v":20.8},{"$f":"ROUND(F10*(1+$I$6),2)","v":1.71},{"$f":"ROUND(H10*E10,2)","v":27.36}]
{"$rows_left_out":61}
{"sheet":"CVCTEC-80","index":6,"n_rows":137,"n_cols":9,"rows_kept":137,"cut":false,"hidden":false,"merged":[[136,0,136,8],[4,0,4,4],[1,0,1,8],[2,0,2,8],[3,0,3,8],[5,0,5,4],[6,0,6,8],[7,0,8,0],[7,1,8,1],[7,2,8,2],[7,3,8,3],[7,4,8,4],[7,5,7,6],[7,7,7,8],[118,0,118,4],[118,5,118,6],[118,7,118,8],[119,0,119,4],[119,5,119,6],[119,7,119,8],[123,0,123,4],[123,5,123,6],[123,7,123,8],[124,0,124,4],[124,5,124,6],[124,7,124,8],[125,0,125,4],[125,5,125,6],[125,7,125,8],[126,0,126,4],[126,5,126,6],[126,7,126,8],[134,0,134,8],[135,0,135,8],[127,0,127,4],[127,5,127,6],[127,7,127,8],[130,0,130,8],[132,0,132,6],[133,0,133,8]]}
[]
["PLANILHA ORÇAMENTÁRIA "]
["OBJETO: PROJETOS DE MODIFICAÇÃO, EXTENSÃO DE REDE  E ILUMINAÇÃO PÚBLICA"]
["LOCAL: CVCTEC_PMINAS_80 - RUA ARTHUR MAGALHAES - B. NOVA FLORESTA"]
["RESPONSÁVEL TÉCNICO: DIOGO SOARES RESENDE",null,null,null,null,"CREA:",{"$f":"LEFT(RIGHT(RESUMO!B23,11),8)","v":"194.419D"},"ART:"]
["REFERENCIA DE PREÇOS: PREÇOS DE MERCADO",null,null,null,null,"DATA: ",{"$f":"RESUMO!E5","v":"2020-02-04"},"BDI :",{"$f":"RESUMO!F5","v":0.31559999999999999}]
[]
["ITEM","CÓDIGO ","DESCRIÇÃO","UNID.","QUANT.","PREÇO SEM BDI",null,"PREÇO COM BDI"]
[null,null,null,null,null,"UNITÁRIO ","TOTAL","UNITÁRIO ","TOTAL"]
[1,237222,{"$f":"VLOOKUP(B10,TAB.REF!$A$3:$D$140,2)","v":"AFASTADOR ARMAÇÃO SECUNDÁRIA 500MM"},{"$f":"VLOOKUP(B10,TAB.REF!$A$3:$D$140,3)","v":"PC"},1,{"$f":"VLOOKUP(B10,TAB.REF!$A$3:$D$140,4)","v":124.8},{"$f":"ROUND(F10*E10,2)","v":124.8},{"$f":"ROUND(F10*(1+$I$6),2)","v":164.19},{"$f":"ROUND(H10*E10,2)","v":164.19}]
{"$rows_left_out":128}
{"sheet":"CVCTEC-83","index":7,"n_rows":132,"n_cols":9,"rows_kept":132,"cut":false,"hidden":false,"merged":[[129,0,129,8],[130,0,130,8],[131,0,131,8],[122,0,122,4],[122,5,122,6],[122,7,122,8],[125,0,125,8],[127,0,127,6],[128,0,128,8],[120,0,120,4],[120,5,120,6],[120,7,120,8],[121,0,121,4],[121,5,121,6],[121,7,121,8],[118,0,118,4],[118,5,118,6],[118,7,118,8],[119,0,119,4],[119,5,119,6],[119,7,119,8],[113,0,113,4],[113,5,113,6],[113,7,113,8],[114,0,114,4],[114,5,114,6],[114,7,114,8],[5,0,5,4],[6,0,6,8],[7,0,8,0],[7,1,8,1],[7,2,8,2],[7,3,8,3],[7,4,8,4],[7,5,7,6],[7,7,7,8],[0,0,0,8],[1,0,1,8],[2,0,2,8],[3,0,3,8],[4,0,4,4]]}
[]
["PLANILHA ORÇAMENTÁRIA "]
["OBJETO: PROJETOS DE MODIFICAÇÃO, EXTENSÃO DE REDE  E ILUMINAÇÃO PÚBLICA"]
["LOCAL: CVCTEC_PMINAS_83 - AVENIDA DOS BURITIS - B. ALTO DA COLINA"]
["RESPONSÁVEL TÉCNICO: DIOGO SOARES RESENDE",null,null,null,null,"CREA:",{"$f":"LEFT(RIGHT(RESUMO!B23,11),8)","v":"194.419D"},"ART:"]
["REFERENCIA DE PREÇOS: PREÇOS DE MERCADO",null,null,null,null,"DATA: ",{"$f":"RESUMO!E5","v":"2020-02-04"},"BDI :",{"$f":"RESUMO!F5","v":0.31559999999999999}]
[]
["ITEM","CÓDIGO ","DESCRIÇÃO","UNID.","QUANT.","PREÇO SEM BDI",null,"PREÇO COM BDI"]
[null,null,null,null,null,"UNITÁRIO ","TOTAL","UNITÁRIO ","TOTAL"]
[1,237222,{"$f":"VLOOKUP(B10,TAB.REF!$A$3:$D$140,2)","v":"AFASTADOR ARMAÇÃO SECUNDÁRIA 500MM"},{"$f":"VLOOKUP(B10,TAB.REF!$A$3:$D$140,3)","v":"PC"},1,{"$f":"VLOOKUP(B10,TAB.REF!$A$3:$D$140,4)","v":124.8},{"$f":"ROUND(F10*E10,2)","v":124.8},{"$f":"ROUND(F10*(1+$I$6),2)","v":164.19},{"$f":"ROUND(H10*E10,2)","v":164.19}]
{"$rows_left_out":123}
{"sheet":"CVCTEC-84","index":8,"n_rows":99,"n_cols":9,"rows_kept":99,"cut":false,"hidden":false,"merged":[[96,0,96,8],[97,0,97,8],[98,0,98,8],[89,0,89,4],[89,5,89,6],[89,7,89,8],[92,0,92,8],[94,0,94,6],[95,0,95,8],[87,0,87,4],[87,5,87,6],[87,7,87,8],[88,0,88,4],[88,5,88,6],[88,7,88,8],[85,0,85,4],[85,5,85,6],[85,7,85,8],[86,0,86,4],[86,5,86,6],[86,7,86,8],[80,0,80,4],[80,5,80,6],[80,7,80,8],[81,0,81,4],[81,5,81,6],[81,7,81,8],[5,0,5,4],[6,0,6,8],[7,0,8,0],[7,1,8,1],[7,2,8,2],[7,3,8,3],[7,4,8,4],[7,5,7,6],[7,7,7,8],[0,0,0,8],[1,0,1,8],[2,0,2,8],[3,0,3,8],[4,0,4,4]]}
[]
["PLANILHA ORÇAMENTÁRIA "]
["OBJETO: PROJETOS DE MODIFICAÇÃO, EXTENSÃO DE REDE  E ILUMINAÇÃO PÚBLICA"]
["LOCAL: CVCTEC_PMINAS_84 - RUA SAGITÁRIO - JARDIM PELUZZO"]
["RESPONSÁVEL TÉCNICO: DIOGO SOARES RESENDE",null,null,null,null,"CREA:",{"$f":"LEFT(RIGHT(RESUMO!B23,11),8)","v":"194.419D"},"ART:"]
["REFERENCIA DE PREÇOS: PREÇOS DE MERCADO",null,null,null,null,"DATA: ",{"$f":"RESUMO!E5","v":"2020-02-04"},"BDI :",{"$f":"RESUMO!F5","v":0.31559999999999999}]
[]
["ITEM","CÓDIGO ","DESCRIÇÃO","UNID.","QUANT.","PREÇO SEM BDI",null,"PREÇO COM BDI"]
[null,null,null,null,null,"UNITÁRIO ","TOTAL","UNITÁRIO ","TOTAL"]
[1,237222,{"$f":"VLOOKUP(B10,TAB.REF!$A$3:$D$140,2)","v":"AFASTADOR ARMAÇÃO SECUNDÁRIA 500MM"},{"$f":"VLOOKUP(B10,TAB.REF!$A$3:$D$140,3)","v":"PC"},1,{"$f":"VLOOKUP(B10,TAB.REF!$A$3:$D$140,4)","v":124.8},{"$f":"ROUND(F10*E10,2)","v":124.8},{"$f":"ROUND(F10*(1+$I$6),2)","v":164.19},{"$f":"ROUND(H10*E10,2)","v":164.19}]
{"$rows_left_out":90}
{"sheet":"PMPATOS_004DR","index":9,"n_rows":48,"n_cols":9,"rows_kept":48,"cut":false,"hidden":false,"merged":[[45,0,45,8],[46,0,46,8],[41,0,41,8],[47,0,47,8],[38,0,38,4],[38,5,38,6],[38,7,38,8],[43,0,43,6],[44,0,44,8],[36,0,36,4],[36,5,36,6],[36,7,36,8],[37,0,37,4],[37,5,37,6],[37,7,37,8],[34,0,34,4],[34,5,34,6],[34,7,34,8],[35,0,35,4],[35,5,35,6],[35,7,35,8],[27,0,27,4],[27,5,27,6],[27,7,27,8],[30,0,30,4],[30,5,30,6],[30,7,30,8],[7,0,7,8],[8,0,9,0],[8,1,9,1],[8,2,9,2],[8,3,9,3],[8,4,9,4],[8,5,8,6],[8,7,8,8],[6,0,6,4],[2,0,2,8],[0,0,0,8],[1,0,1,8],[3,0,3,8],[4,1,4,2],[5,0,5,4]]}
[]
["PLANILHA ORÇAMENTÁRIA "]
["OBJETO: PROJETOS DE MODIFICAÇÃO, EXTENSÃO DE REDE  E ILUMINAÇÃO PÚBLICA"]
["OBRA: OBRAS DE EXTENSÃO E MODIFICAÇÃO DE REDE DE DISTRIBUIÇÃO DE ENERGIA ELÉTRICA COM INSTALAÇÃO E SUBSTITUIÇÃO DE LUMINÁRIAS PARA EFICIENTIZAÇÃO DA ILUMINAÇÃO PÚBLICA NO MUNICÍPIO DE PATOS DE MINAS-MG."]
["LOCAL:","PMPATOS_004DR - PRAÇA FREI ILDEU - SEBASTIÃO AMORIM"]
["RESPONSÁVEL TÉCNICO: DIOGO SOARES RESENDE",null,null,null,null,"CREA:",{"$f":"LEFT(RIGHT(RESUMO!B23,11),8)","v":"194.419D"},"ART:"]
["REFERENCIA DE PREÇOS: PREÇOS DE MERCADO",null,null,null,null,"DATA: ",{"$f":"RESUMO!E5","v":"2020-02-04"},"BDI :",{"$f":"RESUMO!F5","v":0.31559999999999999}]
[]
["ITEM","CÓDIGO ","DESCRIÇÃO","UNID.","QUANT.","PREÇO SEM BDI",null,"PREÇO COM BDI"]
[null,null,null,null,null,"UNITÁRIO ","TOTAL","UNITÁRIO ","TOTAL"]
{"$rows_left_out":39}
{"sheet":"PMPATOS_005DR","index":10,"n_rows":49,"n_cols":9,"rows_kept":49,"cut":false,"hidden":false,"merged":[[46,0,46,8],[47,0,47,8],[42,0,42,8],[48,0,48,8],[39,0,39,4],[39,5,39,6],[39,7,39,8],[44,0,44,6],[45,0,45,8],[37,0,37,4],[37,5,37,6],[37,7,37,8],[38,0,38,4],[38,5,38,6],[38,7,38,8],[35,0,35,4],[35,5,35,6],[35,7,35,8],[36,0,36,4],[36,5,36,6],[36,7,36,8],[28,0,28,4],[28,5,28,6],[28,7,28,8],[31,0,31,4],[31,5,31,6],[31,7,31,8],[7,0,7,8],[8,0,9,0],[8,1,9,1],[8,2,9,2],[8,3,9,3],[8,4,9,4],[8,5,8,6],[8,7,8,8],[6,0,6,4],[2,0,2,8],[0,0,0,8],[1,0,1,8],[3,0,3,8],[4,1,4,2],[5,0,5,4]]}
[]
["PLANILHA ORÇAMENTÁRIA "]
["OBJETO: PROJETOS DE MODIFICAÇÃO, EXTENSÃO DE REDE  E ILUMINAÇÃO PÚBLICA"]
["OBRA: OBRAS DE EXTENSÃO E MODIFICAÇÃO DE REDE DE DISTRIBUIÇÃO DE ENERGIA ELÉTRICA COM INSTALAÇÃO E SUBSTITUIÇÃO DE LUMINÁRIAS PARA EFICIENTIZAÇÃO DA ILUMINAÇÃO PÚBLICA NO MUNICÍPIO DE PATOS DE MINAS-MG."]
["LOCAL:","PMPATOS_005DR - PRAÇA JOSÉ DE BRITO - JARDIM PELUZZO"]
["RESPONSÁVEL TÉCNICO: DIOGO SOARES RESENDE",null,null,null,null,"CREA:",{"$f":"LEFT(RIGHT(RESUMO!B23,11),8)","v":"194.419D"},"ART:"]
["REFERENCIA DE PREÇOS: PREÇOS DE MERCADO",null,null,null,null,"DATA: ",{"$f":"RESUMO!E5","v":"2020-02-04"},"BDI :",{"$f":"RESUMO!F5","v":0.31559999999999999}]
[]
["ITEM","CÓDIGO ","DESCRIÇÃO","UNID.","QUANT.","PREÇO SEM BDI",null,"PREÇO COM BDI"]
[null,null,null,null,null,"UNITÁRIO ","TOTAL","UNITÁRIO ","TOTAL"]
{"$rows_left_out":39}